Reaction Details
TargetPhosphatidylinositol 4-phosphate 5-kinase type-1 gamma
LigandBDBM50107268
Substrate/Competitorn/a
Meas. Tech.ChEMBL_1508846 (CHEMBL3603395)
IC50 10000±n/a nM
Citation Raubo, PAndrews, DMMcKelvie, JCRobb, GRSmith, JMSwarbrick, MEWaring, MJ Discovery of potent, selective small molecule inhibitors ofa-subtype of type III phosphatidylinositol-4-kinase (PI4KIIIa). Bioorg Med Chem Lett25:3189-93 (2015) 
 
Phosphatidylinositol 4-phosphate 5-kinase type-1 gamma
Name:Phosphatidylinositol 4-phosphate 5-kinase type-1 gamma
Type:PROTEIN
Mol. Mass.:73241.99
Organism:Homo sapiens (Human)
Description:ChEMBL_1508846
Residue:668
BDBM50107268
NameBDBM50107268
Synonyms:CHEMBL3600693
TypeSmall organic molecule
Emp. Form.C13H11N3O2S2
Mol. Mass.305.375
SMILESCS(=O)(=O)c1ccc(cn1)-c1ccc2nc(N)sc2c1