Reaction Details
TargetPhosphatidylinositol 4-kinase beta
LigandBDBM50333219
Substrate/Competitorn/a
Meas. Tech.ChEMBL_1508841 (CHEMBL3603390)
IC50 1000±n/a nM
Citation Raubo, PAndrews, DMMcKelvie, JCRobb, GRSmith, JMSwarbrick, MEWaring, MJ Discovery of potent, selective small molecule inhibitors ofa-subtype of type III phosphatidylinositol-4-kinase (PI4KIIIa). Bioorg Med Chem Lett25:3189-93 (2015) 
 
Phosphatidylinositol 4-kinase beta
Name:Phosphatidylinositol 4-kinase beta
Type:Protein
Mol. Mass.:91373.30
Organism:Homo sapiens (Human)
Description:n/a
Residue:816
BDBM50333219
NameBDBM50333219
Synonyms:6-(6-methoxypyridin-3-yl)benzo[d]thiazol-2-amine | CHEMBL1645105
TypeSmall organic molecule
Emp. Form.C13H11N3OS
Mol. Mass.257.311
SMILESCOc1ccc(cn1)-c1ccc2nc(N)sc2c1