Reaction Details
TargetPhosphatidylinositol 4-kinase alpha
LigandBDBM50107257
Substrate/Competitorn/a
Meas. Tech.ChEMBL_1508840 (CHEMBL3603389)
IC50 1.000000±n/a nM
Citation Raubo, PAndrews, DMMcKelvie, JCRobb, GRSmith, JMSwarbrick, MEWaring, MJ Discovery of potent, selective small molecule inhibitors ofa-subtype of type III phosphatidylinositol-4-kinase (PI4KIIIa). Bioorg Med Chem Lett25:3189-93 (2015) 
 
Phosphatidylinositol 4-kinase alpha
Name:Phosphatidylinositol 4-kinase alpha
Type:Protein
Mol. Mass.:231326.70
Organism:Homo sapiens (Human)
Description:P42356
Residue:2102
BDBM50107257
NameBDBM50107257
Synonyms:CHEMBL3600785
TypeSmall organic molecule
Emp. Form.C24H27N3O3S
Mol. Mass.437.554
SMILESOC(=O)[C@H]1CC[C@H](CNc2nc3ccc(cc3s2)-c2ccn(CC3CC3)c(=O)c2)CC1