Reaction Details
TargetPhosphatidylinositol 4-kinase alpha
LigandBDBM50107248
Substrate/Competitorn/a
Meas. Tech.ChEMBL_1508840 (CHEMBL3603389)
IC50 5.0±n/a nM
Citation Raubo, PAndrews, DMMcKelvie, JCRobb, GRSmith, JMSwarbrick, MEWaring, MJ Discovery of potent, selective small molecule inhibitors ofa-subtype of type III phosphatidylinositol-4-kinase (PI4KIIIa). Bioorg Med Chem Lett25:3189-93 (2015) 
 
Phosphatidylinositol 4-kinase alpha
Name:Phosphatidylinositol 4-kinase alpha
Type:Protein
Mol. Mass.:231326.70
Organism:Homo sapiens (Human)
Description:P42356
Residue:2102
BDBM50107248
NameBDBM50107248
Synonyms:CHEMBL3600781
TypeSmall organic molecule
Emp. Form.C22H25N3O2S
Mol. Mass.395.518
SMILESO=c1cc(ccn1CC1CC1)-c1ccc2nc(NCC3CCOCC3)sc2c1