Reaction Details
TargetPhosphatidylinositol 4-kinase alpha
LigandBDBM50107238
Substrate/Competitorn/a
Meas. Tech.ChEMBL_1508840 (CHEMBL3603389)
IC50 158±n/a nM
Citation Raubo, PAndrews, DMMcKelvie, JCRobb, GRSmith, JMSwarbrick, MEWaring, MJ Discovery of potent, selective small molecule inhibitors ofa-subtype of type III phosphatidylinositol-4-kinase (PI4KIIIa). Bioorg Med Chem Lett25:3189-93 (2015) 
 
Phosphatidylinositol 4-kinase alpha
Name:Phosphatidylinositol 4-kinase alpha
Type:Protein
Mol. Mass.:231326.70
Organism:Homo sapiens (Human)
Description:P42356
Residue:2102
BDBM50107238
NameBDBM50107238
Synonyms:CHEMBL3600776
TypeSmall organic molecule
Emp. Form.C17H14N4S
Mol. Mass.306.385
SMILESNc1nc2ccc(cc2s1)-c1cnn(Cc2ccccc2)c1