Reaction Details
TargetPhosphatidylinositol 4-kinase alpha
LigandBDBM50106970
Substrate/Competitorn/a
Meas. Tech.ChEMBL_1508840 (CHEMBL3603389)
IC50 316±n/a nM
Citation Raubo, PAndrews, DMMcKelvie, JCRobb, GRSmith, JMSwarbrick, MEWaring, MJ Discovery of potent, selective small molecule inhibitors ofa-subtype of type III phosphatidylinositol-4-kinase (PI4KIIIa). Bioorg Med Chem Lett25:3189-93 (2015) 
 
Phosphatidylinositol 4-kinase alpha
Name:Phosphatidylinositol 4-kinase alpha
Type:Protein
Mol. Mass.:231326.70
Organism:Homo sapiens (Human)
Description:P42356
Residue:2102
BDBM50106970
NameBDBM50106970
Synonyms:CHEMBL3600767
TypeSmall organic molecule
Emp. Form.C12H9N3OS
Mol. Mass.243.284
SMILESNc1nc2ccc(cc2s1)-c1cc[nH]c(=O)c1