Reaction Details
TargetEndothelin-1 receptor
LigandBDBM50108104
Substrate/Competitorn/a
Meas. Tech.ChEMBL_1509801 (CHEMBL3603684)
IC50 11±n/a nM
Citation Lu, JAguilar, AZou, BBao, WKoldas, SShi, ADesper, JWangemann, PXie, XSHua, DH Chemical synthesis of tetracyclic terpenes and evaluation of antagonistic activity on endothelin-A receptors and voltage-gated calcium channels. Bioorg Med Chem23:5985-98 (2015) 
 
Endothelin-1 receptor
Name:Endothelin-1 receptor
Type:Enzyme Catalytic Domain
Mol. Mass.:48256.91
Organism:RAT
Description:ENDOTHELIN A EDNRA RAT::P26684
Residue:426
BDBM50108104
NameBDBM50108104
Synonyms:CHEMBL3601500
TypeSmall organic molecule
Emp. Form.C39H52O7
Mol. Mass.632.826
SMILES[H][C@@]12CC(C)(C)CC[C@@]1(CC[C@]1(COC(=O)\C=C\c3ccc(O)c(O)c3)C2=CC[C@]2([H])[C@@]3(C)CCC(=O)C(C)(C)[C@]3([H])CC[C@@]12C)C(O)=O