Reaction Details
TargetCarbonic anhydrase 1
LigandBDBM50028265
Substrate/Competitorn/a
Meas. Tech.ChEMBL_1508203 (CHEMBL3603160)
Ki 9500±n/a nM
Citation Mahon, BPLomelino, CLLadwig, JRankin, GMDriscoll, JMSalguero, ALPinard, MAVullo, DSupuran, CTPoulsen, SAMcKenna, R Mapping Selective Inhibition of the Cancer-Related Carbonic Anhydrase IX Using Structure-Activity Relationships of Glucosyl-Based Sulfamates. J Med Chem58:6630-8 (2015) 
 
Carbonic anhydrase 1
Name:Carbonic anhydrase 1
Type:Enzyme
Mol. Mass.:28873.37
Organism:Homo sapiens (Human)
Description:P00915
Residue:261
BDBM50028265
NameBDBM50028265
Synonyms:CHEMBL3342252
TypeSmall organic molecule
Emp. Form.C20H30N2O16S2
Mol. Mass.618.586
SMILESCOC(=O)[C@@H]1C[C@H](CN1S(=O)(=O)[C@@H]1O[C@H](COC(C)=O)[C@@H](OC(C)=O)[C@H](OC(C)=O)[C@H]1OC(C)=O)OS(N)(=O)=O