Reaction Details
TargetSteryl-sulfatase
LigandBDBM50108119
Substrate/Competitorn/a
Meas. Tech.ChEMBL_1508418 (CHEMBL3602392)
Ki 1.000000±n/a nM
Citation Mostafa, YAKralt, BRao, PPTaylor, SD A-ring substituted 17ß-arylsulfonamides of 17ß-aminoestra-1,3,5(10)-trien-3-ol as highly potent reversible inhibitors of steroid sulfatase. Bioorg Med Chem23:5681-92 (2015) 
 
Steryl-sulfatase
Name:Steryl-sulfatase
Type:Enzyme
Mol. Mass.:65503.66
Organism:Homo sapiens (Human)
Description:P08842
Residue:583
BDBM50108119
NameBDBM50108119
Synonyms:CHEMBL3600587
TypeSmall organic molecule
Emp. Form.C30H32N2O5S
Mol. Mass.532.65
SMILES[H][C@@]12CC[C@H](NS(=O)(=O)c3ccc(cc3)-c3ccccc3)[C@@]1(C)CC[C@]1([H])c3ccc(O)c(c3CC[C@@]21[H])[N+]([O-])=O