Reaction Details
TargetGenome polyprotein
LigandBDBM50109138
Substrate/Competitorn/a
Meas. Tech.ChEMBL_1508920 (CHEMBL3602139)
Ki 820±n/a nM
Citation Bastos Lima, ABehnam, MAEl Sherif, YNitsche, CVechi, SMKlein, CD Dual inhibitors of the dengue and West Nile virus NS2B-NS3 proteases: Synthesis, biological evaluation and docking studies of novel peptide-hybrids. Bioorg Med Chem23:5748-55 (2015) 
 
Genome polyprotein
Name:Genome polyprotein
Type:PROTEIN
Mol. Mass.:380170.63
Organism:West Nile virus
Description:ChEMBL_1438217
Residue:3430
BDBM50109138
NameBDBM50109138
Synonyms:CHEMBL3601351
TypeSmall organic molecule
Emp. Form.C38H51N9O6S
Mol. Mass.761.933
SMILESNCCCC[C@H](NC(=O)[C@H](CCCNC(N)=N)NC(=O)c1ccc(\C=C2/SC(=O)N(CC3CCCCC3)C2=O)cc1)C(=O)N[C@H](C(N)=O)c1ccccc1