Reaction Details
TargetSignal transducer and activator of transcription 3
LigandBDBM50109349
Substrate/Competitorn/a
Meas. Tech.ChEMBL_1509016 (CHEMBL3602459)
IC50 320±n/a nM
Citation Lai, MJLee, HYChuang, HYChang, LHTsai, ACChen, MCHuang, HLWu, YWTeng, CMPan, SLLiu, YMMehndiratta, SLiou, JP N-Sulfonyl-aminobiaryls as Antitubulin Agents and Inhibitors of Signal Transducers and Activators of Transcription 3 (STAT3) Signaling. J Med Chem58:6549-58 (2015) 
 
Signal transducer and activator of transcription 3
Name:Signal transducer and activator of transcription 3
Type:Protein
Mol. Mass.:88064.31
Organism:Homo sapiens (Human)
Description:P40763
Residue:770
BDBM50109349
NameBDBM50109349
Synonyms:CHEMBL3600853
TypeSmall organic molecule
Emp. Form.C22H18N2O4S
Mol. Mass.406.454
SMILESCOc1ccc(cc1)S(=O)(=O)N(C(C)=O)c1ccccc1-c1ccc(cc1)C#N