Reaction Details
TargetBreakpoint cluster region protein/Tyrosine-protein kinase ABL1
LigandBDBM50110427
Substrate/Competitorn/a
Meas. Tech.ChEMBL_1511917 (CHEMBL3606398)
IC50 30±n/a nM
Citation Lu, XZhang, ZRen, XPan, XWang, DZhuang, XLuo, JYu, RDing, K Hybrid pyrimidine alkynyls inhibit the clinically resistance related Bcr-Abl(T315I) mutant. Bioorg Med Chem Lett25:3458-63 (2015) 
 
Breakpoint cluster region protein/Tyrosine-protein kinase ABL1
Name:Breakpoint cluster region protein/Tyrosine-protein kinase ABL1
Type:Enzyme
Mol. Mass.:n/a
Description:n/a
Components:This complex has 2 components.
Component 1
Name:Tyrosine-protein kinase ABL1
Synonyms:ABL ABL1_HUMAN JTK7 Proto-oncogene tyrosine-protein kinase ABL1 Tyrosine-protein kinase ABL V-abl Abelson murine leukemia viral oncogene homolog 1 p150 | tyrosine-protein kinase ABL1 isoform a
Type:Enzyme
Mol. Mass.:122897.30
Organism:Homo sapiens (Human)
Description:P00519
Residue:1130
Component 2
Name:Breakpoint cluster region protein
Synonyms:BCR BCR_HUMAN Breakpoint cluster region protein | D22S11
Type:PROTEIN
Mol. Mass.:142824.75
Organism:Homo sapiens (Human)
Description:ChEMBL_305348
Residue:1271
BDBM50110427
NameBDBM50110427
Synonyms:CHEMBL3605772
TypeSmall organic molecule
Emp. Form.C27H23F3N6O
Mol. Mass.504.5063
SMILESCCNc1ncc(cn1)C#Cc1cc(ccc1C)C(=O)Nc1cc(cc(c1)C(F)(F)F)-n1cnc(C)c1