Reaction Details
TargetBreakpoint cluster region protein/Tyrosine-protein kinase ABL1
LigandBDBM50237710
Substrate/Competitorn/a
Meas. Tech.ChEMBL_1511918 (CHEMBL3606399)
IC50>1000±n/a nM
Citation Lu, XZhang, ZRen, XPan, XWang, DZhuang, XLuo, JYu, RDing, K Hybrid pyrimidine alkynyls inhibit the clinically resistance related Bcr-Abl(T315I) mutant. Bioorg Med Chem Lett25:3458-63 (2015) 
 
Breakpoint cluster region protein/Tyrosine-protein kinase ABL1
Name:Breakpoint cluster region protein/Tyrosine-protein kinase ABL1
Type:Enzyme
Mol. Mass.:n/a
Description:n/a
Components:This complex has 2 components.
Component 1
Name:Tyrosine-protein kinase ABL1
Synonyms:ABL ABL1_HUMAN JTK7 Proto-oncogene tyrosine-protein kinase ABL1 Tyrosine-protein kinase ABL V-abl Abelson murine leukemia viral oncogene homolog 1 p150 | tyrosine-protein kinase ABL1 isoform a
Type:Enzyme
Mol. Mass.:122897.30
Organism:Homo sapiens (Human)
Description:P00519
Residue:1130
Component 2
Name:Breakpoint cluster region protein
Synonyms:BCR BCR_HUMAN Breakpoint cluster region protein | D22S11
Type:PROTEIN
Mol. Mass.:142824.75
Organism:Homo sapiens (Human)
Description:ChEMBL_305348
Residue:1271
BDBM50237710
NameBDBM50237710
Synonyms:4-methyl-N-[3-(4-methyl-1H-imidazol-1-yl)-5-(trifluoromethyl)phenyl]-3-[(4-pyridin-3-ylpyrimidin-2-yl)amino]benzamide AMN107 NILOTINIB | US11649218, Example Nilotinib
TypeSmall organic molecule
Emp. Form.C28H22F3N7O
Mol. Mass.529.5158
SMILESCc1cn(cn1)-c1cc(NC(=O)c2ccc(C)c(Nc3nccc(n3)-c3cccnc3)c2)cc(c1)C(F)(F)F