Reaction Details
Target2-acylglycerol O-acyltransferase 2
LigandBDBM159693
Substrate/Competitorn/a
Meas. Tech.ChEMBL_1510039 (CHEMBL3606131)
IC50 168±n/a nM
Citation Busujima, TTanaka, HShirasaki, YMunetomo, ESaito, MKitano, KMinagawa, TYoshida, KOsaki, NSato, N Identification of 2-[2-(4-tert-butylphenyl)ethyl]-N-(4-fluorophenyl)-1,2,3,4-tetrahydroisoquinoline-6-sulfonamide (29) as an orally available MGAT2 inhibitor. Bioorg Med Chem23:5922-31 (2015) 
 
2-acylglycerol O-acyltransferase 2
Name:2-acylglycerol O-acyltransferase 2
Type:Enzyme
Mol. Mass.:38210.80
Organism:Homo sapiens (Human)
Description:Q3SYC2
Residue:334
BDBM159693
NameBDBM159693
Synonyms:US9035059, 14-9
TypeSmall organic molecule
Emp. Form.C26H28FN3O4S
Mol. Mass.497.582
SMILESCOc1cc(F)ccc1NS(=O)(=O)c1ccc2CN(Cc2c1)C(=O)Nc1ccc(cc1)C(C)(C)C