Reaction Details
TargetEukaryotic translation initiation factor 4E
LigandBDBM50110843
Substrate/Competitorn/a
Meas. Tech.ChEMBL_1511842 (CHEMBL3608168)
IC50 560±n/a nM
Citation Ziemniak, MKowalska, JLukaszewicz, MZuberek, JWnek, KDarzynkiewicz, EJemielity, J Phosphate-modified analogues of m(7)GTP and m(7)Gppppm(7)G-Synthesis and biochemical properties. Bioorg Med Chem23:5369-81 (2015) 
 
Eukaryotic translation initiation factor 4E
Name:Eukaryotic translation initiation factor 4E
Type:PROTEIN
Mol. Mass.:25047.40
Organism:Oryctolagus cuniculus
Description:ChEMBL_1511842
Residue:217
BDBM50110843
NameBDBM50110843
Synonyms:CHEMBL3604542
TypeSmall organic molecule
Emp. Form.C11H30N9O13P3S
Mol. Mass.621.395
SMILES[NH4+].[NH4+].[NH4+].[NH4+].C[n+]1cn([C@@H]2O[C@H](CO[P@@]([S-])(=O)OP([O-])(=O)OP([O-])([O-])=O)[C@@H](O)[C@H]2O)c2nc(N)nc([O-])c12