Reaction Details
TargetEukaryotic translation initiation factor 4E
LigandBDBM50110894
Substrate/Competitorn/a
Meas. Tech.ChEMBL_1511841 (CHEMBL3608043)
IC50 2550±n/a nM
Citation Ziemniak, MKowalska, JLukaszewicz, MZuberek, JWnek, KDarzynkiewicz, EJemielity, J Phosphate-modified analogues of m(7)GTP and m(7)Gppppm(7)G-Synthesis and biochemical properties. Bioorg Med Chem23:5369-81 (2015) 
 
Eukaryotic translation initiation factor 4E
Name:Eukaryotic translation initiation factor 4E
Type:PROTEIN
Mol. Mass.:25047.40
Organism:Oryctolagus cuniculus
Description:ChEMBL_1511842
Residue:217
BDBM50110894
NameBDBM50110894
Synonyms:CHEMBL3604539
TypeSmall organic molecule
Emp. Form.C12H35BN9O12P3
Mol. Mass.601.192
SMILES[NH4+].[NH4+].[NH4+].[NH4+].[BH3-][P@@](=O)(OC[C@H]1O[C@H]([C@H](O)[C@@H]1O)n1c[n+](C)c2c([O-])nc(N)nc12)OP([O-])(=O)CP([O-])([O-])=O