Reaction Details
Target11-beta-hydroxysteroid dehydrogenase type 2
LigandBDBM50112133
Substrate/Competitorn/a
Meas. Tech.ChEMBL_1512871 (CHEMBL3611793)
IC50>10.0±n/a nM
Citation Hong, SPNam, KYShin, YJKim, KWAhn, SK Discovery of 11ß-hydroxysteroid dehydrogenase type 1 inhibitor. Bioorg Med Chem Lett25:3501-6 (2015) 
 
11-beta-hydroxysteroid dehydrogenase type 2
Name:11-beta-hydroxysteroid dehydrogenase type 2
Type:Enzyme
Mol. Mass.:44141.72
Organism:Homo sapiens (Human)
Description:Purified recombinant human 11beta-HSD2.
Residue:405
BDBM50112133
NameBDBM50112133
Synonyms:CHEMBL3609861 | US9464044, 71
TypeSmall organic molecule
Emp. Form.C21H28FN3O4S
Mol. Mass.437.528
SMILESCC(C)(NS(=O)(=O)c1ccccc1F)C(=O)N[C@H]1C2CC3CC1CC(C3)(C2)C(N)=O