Reaction Details
TargetCarbonic anhydrase 2
LigandBDBM50112760
Substrate/Competitorn/a
Meas. Tech.ChEMBL_1513880 (CHEMBL3611445)
Ki 8.0±n/a nM
Citation Ombouma, JVullo, DDumy, PSupuran, CTWinum, JY Carbonic Anhydrase Glycoinhibitors belonging to the Aminoxysulfonamide Series. ACS Med Chem Lett6:819-21 (2015) 
 
Carbonic anhydrase 2
Name:Carbonic anhydrase 2
Type:Enzyme
Mol. Mass.:29250.71
Organism:Homo sapiens (Human)
Description:P00918
Residue:260
BDBM50112760
NameBDBM50112760
Synonyms:CHEMBL3608320
TypeSmall organic molecule
Emp. Form.C6H12N2O6S
Mol. Mass.240.234
SMILESNOS(=O)(=O)NC1O[C@H](CO)[C@@H](O)C=C1