Reaction Details
TargetCarbonic anhydrase 9
LigandBDBM50112641
Substrate/Competitorn/a
Meas. Tech.ChEMBL_1513881 (CHEMBL3611446)
Ki 57±n/a nM
Citation Ombouma, JVullo, DDumy, PSupuran, CTWinum, JY Carbonic Anhydrase Glycoinhibitors belonging to the Aminoxysulfonamide Series. ACS Med Chem Lett6:819-21 (2015) 
 
Carbonic anhydrase 9
Name:Carbonic anhydrase 9
Type:Enzyme
Mol. Mass.:49669.03
Organism:Homo sapiens (Human)
Description:Catalytic domain of human cloned isozyme was used in the assay
Residue:459
BDBM50112641
NameBDBM50112641
Synonyms:CHEMBL3609430
TypeSmall organic molecule
Emp. Form.C8H10N2O5S
Mol. Mass.246.24
SMILESNS(=O)(=O)ONC(=O)OCc1ccccc1