Reaction Details
TargetCarbonic anhydrase 9
LigandBDBM50112783
Substrate/Competitorn/a
Meas. Tech.ChEMBL_1513881 (CHEMBL3611446)
Ki 90±n/a nM
Citation Ombouma, JVullo, DDumy, PSupuran, CTWinum, JY Carbonic Anhydrase Glycoinhibitors belonging to the Aminoxysulfonamide Series. ACS Med Chem Lett6:819-21 (2015) 
 
Carbonic anhydrase 9
Name:Carbonic anhydrase 9
Type:Enzyme
Mol. Mass.:49669.03
Organism:Homo sapiens (Human)
Description:Catalytic domain of human cloned isozyme was used in the assay
Residue:459
BDBM50112783
NameBDBM50112783
Synonyms:CHEMBL3609432
TypeSmall organic molecule
Emp. Form.C10H16N2O8S
Mol. Mass.324.308
SMILESCC(=O)OC[C@H]1OC(NS(=O)(=O)ON)C=C[C@@H]1OC(C)=O