Reaction Details
TargetCarbonic anhydrase 12
LigandBDBM50112638
Substrate/Competitorn/a
Meas. Tech.ChEMBL_1513882 (CHEMBL3611447)
Ki 556±n/a nM
Citation Ombouma, JVullo, DDumy, PSupuran, CTWinum, JY Carbonic Anhydrase Glycoinhibitors belonging to the Aminoxysulfonamide Series. ACS Med Chem Lett6:819-21 (2015) 
 
Carbonic anhydrase 12
Name:Carbonic anhydrase 12
Type:Enzyme
Mol. Mass.:39456.00
Organism:Homo sapiens (Human)
Description:Catalytic domain of human cloned isozyme was used in the assay
Residue:354
BDBM50112638
NameBDBM50112638
Synonyms:CHEMBL3609431
TypeSmall organic molecule
Emp. Form.C8H10N2O5S
Mol. Mass.246.24
SMILESNOS(=O)(=O)NC(=O)OCc1ccccc1