Reaction Details
TargetCarbonic anhydrase 1
LigandBDBM50112762
Substrate/Competitorn/a
Meas. Tech.ChEMBL_1513879 (CHEMBL3611444)
Ki 250±n/a nM
Citation Ombouma, JVullo, DDumy, PSupuran, CTWinum, JY Carbonic Anhydrase Glycoinhibitors belonging to the Aminoxysulfonamide Series. ACS Med Chem Lett6:819-21 (2015) 
 
Carbonic anhydrase 1
Name:Carbonic anhydrase 1
Type:Enzyme
Mol. Mass.:28873.37
Organism:Homo sapiens (Human)
Description:P00915
Residue:261
BDBM50112762
NameBDBM50112762
Synonyms:CHEMBL3609437
TypeSmall organic molecule
Emp. Form.C6H12N2O6S
Mol. Mass.240.234
SMILESNOS(=O)(=O)NC1O[C@H](CO)[C@H](O)C=C1