Reaction Details
TargetCarbonic anhydrase 1
LigandBDBM50112784
Substrate/Competitorn/a
Meas. Tech.ChEMBL_1513879 (CHEMBL3611444)
Ki 69±n/a nM
Citation Ombouma, JVullo, DDumy, PSupuran, CTWinum, JY Carbonic Anhydrase Glycoinhibitors belonging to the Aminoxysulfonamide Series. ACS Med Chem Lett6:819-21 (2015) 
 
Carbonic anhydrase 1
Name:Carbonic anhydrase 1
Type:Enzyme
Mol. Mass.:28873.37
Organism:Homo sapiens (Human)
Description:P00915
Residue:261
BDBM50112784
NameBDBM50112784
Synonyms:CHEMBL3609433
TypeSmall organic molecule
Emp. Form.C10H16N2O8S
Mol. Mass.324.308
SMILESCC(=O)OC[C@H]1OC(NS(=O)(=O)ON)C=C[C@H]1OC(C)=O