Reaction Details
TargetLIP1, secretory lipase (Family 3)
LigandBDBM50112882
Substrate/Competitorn/a
Meas. Tech.ChEMBL_1512202 (CHEMBL3611484)
IC50>200000±n/a nM
Citation Guo, SHuang, WZhang, JWang, Y Novel inhibitor against Malassezia globosa LIP1 (SMG1), a potential anti-dandruff target. Bioorg Med Chem Lett25:3464-7 (2015) 
 
LIP1, secretory lipase (Family 3)
Name:LIP1, secretory lipase (Family 3)
Synonyms:LIP1, secretory lipase (Family 3)
Type:PROTEIN
Mol. Mass.:33701.74
Organism:Malassezia globosa (strain ATCC MYA-4612 / CBS 7966)(Dandruff-associated fungus)
Description:ChEMBL_109860
Residue:304
BDBM50112882
NameBDBM50112882
Synonyms:CHEMBL1548385
TypeSmall organic molecule
Emp. Form.C15H18N2O2S2
Mol. Mass.322.446
SMILESO=C1N(CCSC(=S)N2CCOCC2)Cc2ccccc12