Reaction Details
TargetMelanocyte-stimulating hormone receptor
LigandBDBM50112910
Substrate/Competitorn/a
Meas. Tech.ChEMBL_1508702 (CHEMBL3602965)
IC50 9.4±n/a nM
Citation Cai, MMarelli, UKBao, JBeck, JGOpperer, FRechenmacher, FMcLeod, KRZingsheim, MRDoedens, LKessler, HHruby, VJ Systematic Backbone Conformational Constraints on a Cyclic Melanotropin Ligand Leads to Highly Selective Ligands for Multiple Melanocortin Receptors. J Med Chem58:6359-67 (2015) 
 
Melanocyte-stimulating hormone receptor
Name:Melanocyte-stimulating hormone receptor
Type:Enzyme
Mol. Mass.:34717.23
Organism:Homo sapiens (Human)
Description:Q01726
Residue:317
BDBM50112910
NameBDBM50112910
Synonyms:CHEMBL3600921
TypeSmall organic molecule
Emp. Form.C57H77N15O9
Mol. Mass.1116.3164
SMILESCCCC[C@@H](NC(C)=O)C(=O)N[C@H]1CC(=O)NCCCC[C@H](NC(=O)[C@H](Cc2c[nH]c3ccccc23)N(C)C(=O)[C@H](CCCNC(N)=N)N(C)C(=O)[C@@H](Cc2ccc3ccccc3c2)NC(=O)[C@H](Cc2cnc[nH]2)N(C)C1=O)C(N)=O