Reaction Details
TargetMelanocortin receptor 4
LigandBDBM50112889
Substrate/Competitorn/a
Meas. Tech.ChEMBL_1508706 (CHEMBL3602969)
IC50 16±n/a nM
Citation Cai, MMarelli, UKBao, JBeck, JGOpperer, FRechenmacher, FMcLeod, KRZingsheim, MRDoedens, LKessler, HHruby, VJ Systematic Backbone Conformational Constraints on a Cyclic Melanotropin Ligand Leads to Highly Selective Ligands for Multiple Melanocortin Receptors. J Med Chem58:6359-67 (2015) 
 
Melanocortin receptor 4
Name:Melanocortin receptor 4
Type:Enzyme
Mol. Mass.:36949.50
Organism:Homo sapiens (Human)
Description:P32245
Residue:332
BDBM50112889
NameBDBM50112889
Synonyms:CHEMBL3600832
TypeSmall organic molecule
Emp. Form.C55H73N15O9
Mol. Mass.1088.2632
SMILESCCCC[C@@H](NC(C)=O)C(=O)N[C@H]1CC(=O)NCCCC[C@H](NC(=O)[C@H](Cc2c[nH]c3ccccc23)N(C)C(=O)[C@H](CCCNC(N)=N)NC(=O)[C@@H](Cc2ccc3ccccc3c2)NC(=O)[C@H](Cc2cnc[nH]2)NC1=O)C(N)=O