Reaction Details
TargetMitogen-activated protein kinase 1
LigandBDBM50113652
Substrate/Competitorn/a
Meas. Tech.ChEMBL_1510720 (CHEMBL3606322)
IC50>10000±n/a nM
Citation Bagdanoff, JTJain, RHan, WPoon, DLee, PSBellamacina, CLindvall, M Ligand efficient tetrahydro-pyrazolopyridines as inhibitors of ERK2 kinase. Bioorg Med Chem Lett25:3626-9 (2015) 
 
Mitogen-activated protein kinase 1
Name:Mitogen-activated protein kinase 1
Type:Ser/Thr Protein Kinase
Mol. Mass.:41392.76
Organism:Homo sapiens (Human)
Description:P28482
Residue:360
BDBM50113652
NameBDBM50113652
Synonyms:CHEMBL3604856
TypeSmall organic molecule
Emp. Form.C16H15N5O
Mol. Mass.293.3232
SMILESO=c1cc(cc[nH]1)N1CCc2[nH]nc(c2C1)-c1ccncc1