Reaction Details
TargetMitogen-activated protein kinase 1
LigandBDBM50113654
Substrate/Competitorn/a
Meas. Tech.ChEMBL_1510717 (CHEMBL3606319)
IC50 1.8±n/a nM
Citation Bagdanoff, JTJain, RHan, WPoon, DLee, PSBellamacina, CLindvall, M Ligand efficient tetrahydro-pyrazolopyridines as inhibitors of ERK2 kinase. Bioorg Med Chem Lett25:3626-9 (2015) 
 
Mitogen-activated protein kinase 1
Name:Mitogen-activated protein kinase 1
Type:Ser/Thr Protein Kinase
Mol. Mass.:41392.76
Organism:Homo sapiens (Human)
Description:P28482
Residue:360
BDBM50113654
NameBDBM50113654
Synonyms:CHEMBL3604854
TypeSmall organic molecule
Emp. Form.C23H20FN5O
Mol. Mass.401.4362
SMILESFc1ccc(Cn2ccc(cc2=O)N2CCc3[nH]nc(c3C2)-c2ccncc2)cc1