Reaction Details
TargetMitogen-activated protein kinase 1
LigandBDBM50113657
Substrate/Competitorn/a
Meas. Tech.ChEMBL_1510717 (CHEMBL3606319)
IC50 0.200000±n/a nM
Citation Bagdanoff, JTJain, RHan, WPoon, DLee, PSBellamacina, CLindvall, M Ligand efficient tetrahydro-pyrazolopyridines as inhibitors of ERK2 kinase. Bioorg Med Chem Lett25:3626-9 (2015) 
 
Mitogen-activated protein kinase 1
Name:Mitogen-activated protein kinase 1
Type:Ser/Thr Protein Kinase
Mol. Mass.:41392.76
Organism:Homo sapiens (Human)
Description:P28482
Residue:360
BDBM50113657
NameBDBM50113657
Synonyms:CHEMBL3604851
TypeSmall organic molecule
Emp. Form.C23H20BrN5O
Mol. Mass.462.342
SMILESBrc1cccc(Cn2ccc(cc2=O)N2CCc3[nH]nc(c3C2)-c2ccncc2)c1