Reaction Details
TargetP2Y purinoceptor 6
LigandBDBM50114076
Substrate/Competitorn/a
Meas. Tech.ChEMBL_1511151 (CHEMBL3607668)
IC50 112000±n/a nM
Citation Meltzer, DEthan, OArguin, GNadel, YDanino, OLecka, JSévigny, JGendron, FPFischer, B Synthesis and structure-activity relationship of uracil nucleotide derivatives towards the identification of human P2Y6 receptor antagonists. Bioorg Med Chem23:5764-73 (2015) 
 
P2Y purinoceptor 6
Name:P2Y purinoceptor 6
Type:PROTEIN
Mol. Mass.:36452.29
Organism:Homo sapiens (Human)
Description:ChEMBL_1511151
Residue:328
BDBM50114076
NameBDBM50114076
Synonyms:CHEMBL3604024
TypeSmall organic molecule
Emp. Form.C9H11N2Na2O12PS
Mol. Mass.448.208
SMILES[Na+].[Na+].O[C@H]1[C@@H](O)[C@@H](O[C@@H]1COP([O-])(=O)OS([O-])(=O)=O)n1ccc(=O)[nH]c1=O