Reaction Details
TargetAcetylcholinesterase
LigandBDBM50114365
Substrate/Competitorn/a
Meas. Tech.ChEMBL_1511325 (CHEMBL3606230)
IC50 0.600000±n/a nM
Citation Bajda, MJonczyk, JMalawska, BCzarnecka, KGirek, MOlszewska, PSikora, JMikiciuk-Olasik, ESkibinski, RGumieniczek, ASzymanski, P Synthesis, biological evaluation and molecular modeling of new tetrahydroacridine derivatives as potential multifunctional agents for the treatment of Alzheimer's disease. Bioorg Med Chem23:5610-8 (2015) 
 
Acetylcholinesterase
Name:Acetylcholinesterase
Type:Enzyme
Mol. Mass.:71812.79
Organism:Electrophorus electricus (Electric eel)
Description:n/a
Residue:633
BDBM50114365
NameBDBM50114365
Synonyms:CHEMBL3604196
TypeSmall organic molecule
Emp. Form.C28H37ClN4O
Mol. Mass.481.073
SMILESCl.CN(C)c1ccc(cc1)C(=O)NCCCCCCNc1c2CCCCc2nc2ccccc12