Reaction Details
TargetAcetylcholinesterase
LigandBDBM50114368
Substrate/Competitorn/a
Meas. Tech.ChEMBL_1511325 (CHEMBL3606230)
IC50 0.500000±n/a nM
Citation Bajda, MJonczyk, JMalawska, BCzarnecka, KGirek, MOlszewska, PSikora, JMikiciuk-Olasik, ESkibinski, RGumieniczek, ASzymanski, P Synthesis, biological evaluation and molecular modeling of new tetrahydroacridine derivatives as potential multifunctional agents for the treatment of Alzheimer's disease. Bioorg Med Chem23:5610-8 (2015) 
 
Acetylcholinesterase
Name:Acetylcholinesterase
Type:Enzyme
Mol. Mass.:71812.79
Organism:Electrophorus electricus (Electric eel)
Description:n/a
Residue:633
BDBM50114368
NameBDBM50114368
Synonyms:CHEMBL3604199
TypeSmall organic molecule
Emp. Form.C31H43ClN4O
Mol. Mass.523.152
SMILESCl.CN(C)c1ccc(cc1)C(=O)NCCCCCCCCCNc1c2CCCCc2nc2ccccc12