Reaction Details
TargetCholinesterase
LigandBDBM50114361
Substrate/Competitorn/a
Meas. Tech.ChEMBL_1511326 (CHEMBL3606231)
IC50 0.500000±n/a nM
Citation Bajda, MJonczyk, JMalawska, BCzarnecka, KGirek, MOlszewska, PSikora, JMikiciuk-Olasik, ESkibinski, RGumieniczek, ASzymanski, P Synthesis, biological evaluation and molecular modeling of new tetrahydroacridine derivatives as potential multifunctional agents for the treatment of Alzheimer's disease. Bioorg Med Chem23:5610-8 (2015) 
 
Cholinesterase
Name:Cholinesterase
Type:Enzyme
Mol. Mass.:65643.35
Organism:Equus caballus (Horse)
Description:P81908
Residue:574
BDBM50114361
NameBDBM50114361
Synonyms:CHEMBL3604192
TypeSmall organic molecule
Emp. Form.C24H29ClN4O
Mol. Mass.424.966
SMILESCl.CN(C)c1ccc(cc1)C(=O)NCCNc1c2CCCCc2nc2ccccc12