Reaction Details
TargetCholinesterase
LigandBDBM50114368
Substrate/Competitorn/a
Meas. Tech.ChEMBL_1511326 (CHEMBL3606231)
IC50 0.700000±n/a nM
Citation Bajda, MJonczyk, JMalawska, BCzarnecka, KGirek, MOlszewska, PSikora, JMikiciuk-Olasik, ESkibinski, RGumieniczek, ASzymanski, P Synthesis, biological evaluation and molecular modeling of new tetrahydroacridine derivatives as potential multifunctional agents for the treatment of Alzheimer's disease. Bioorg Med Chem23:5610-8 (2015) 
 
Cholinesterase
Name:Cholinesterase
Type:Enzyme
Mol. Mass.:65643.35
Organism:Equus caballus (Horse)
Description:P81908
Residue:574
BDBM50114368
NameBDBM50114368
Synonyms:CHEMBL3604199
TypeSmall organic molecule
Emp. Form.C31H43ClN4O
Mol. Mass.523.152
SMILESCl.CN(C)c1ccc(cc1)C(=O)NCCCCCCCCCNc1c2CCCCc2nc2ccccc12