Reaction Details
TargetL-lactate dehydrogenase A chain
LigandBDBM50114401
Substrate/Competitorn/a
Meas. Tech.ChEMBL_1513323 (CHEMBL3611227)
IC50>200000±n/a nM
Citation Rupiani, SBuonfiglio, RManerba, MDi Ianni, LVettraino, MGiacomini, EMasetti, MFalchi, FDi Stefano, GRoberti, MRecanatini, M Identification of N-acylhydrazone derivatives as novel lactate dehydrogenase A inhibitors. Eur J Med Chem101:63-70 (2015) 
 
L-lactate dehydrogenase A chain
Name:L-lactate dehydrogenase A chain
Type:Protein
Mol. Mass.:36694.85
Organism:Homo sapiens (Human)
Description:P00338::PDB Code: 4ajp
Residue:332
BDBM50114401
NameBDBM50114401
Synonyms:CHEMBL3608328
TypeSmall organic molecule
Emp. Form.C20H14N4O4
Mol. Mass.374.3496
SMILESOC(=O)c1cccc(c1)-c1ccc(\C=N\NC(=O)c2ccc3[nH]ncc3c2)o1