Reaction Details
Target5-hydroxytryptamine receptor 2B
LigandBDBM50114921
Substrate/Competitorn/a
Meas. Tech.ChEMBL_1512579 (CHEMBL3610528)
Ki 209±n/a nM
Citation Kapadia, NHarding, WW C4 phenyl aporphines with selective h5-HT(2B) receptor affinity. Bioorg Med Chem Lett25:3451-4 (2015) 
 
5-hydroxytryptamine receptor 2B
Name:5-hydroxytryptamine receptor 2B
Type:G Protein-Coupled Receptor (GPCR)
Mol. Mass.:54312.47
Organism:Homo sapiens (Human)
Description:Receptor binding assays were performed using human clone stably expressed in CHO cells.
Residue:481
BDBM50114921
NameBDBM50114921
Synonyms:CHEMBL3608451
TypeSmall organic molecule
Emp. Form.C27H27NO4
Mol. Mass.429.5076
SMILESCCOc1c(OC)cc2C(CN(C)C3Cc4cc5OCOc5cc4-c1c23)c1ccccc1