Reaction Details
TargetVoltage-dependent L-type calcium channel subunit alpha-1C
LigandBDBM50116571
Substrate/Competitorn/a
Meas. Tech.ChEMBL_1512774 (CHEMBL3611367)
IC50 173±n/a nM
Citation Renneberg, DHubler, FRey, MHess, PDelahaye, SGatfield, JIglarz, MHilpert, K Discovery of novel bridged tetrahydronaphthalene derivatives as potent T/L-type calcium channel blockers. Bioorg Med Chem Lett25:3941-6 (2015) 
 
Voltage-dependent L-type calcium channel subunit alpha-1C
Name:Voltage-dependent L-type calcium channel subunit alpha-1C
Type:Enzyme Catalytic Domain
Mol. Mass.:248979.79
Organism:Homo sapiens (Human)
Description:Calcium channel (Type L) 0 HUMAN::Q13936
Residue:2221
BDBM50116571
NameBDBM50116571
Synonyms:CHEMBL3609824
TypeSmall organic molecule
Emp. Form.C33H46FN3O3
Mol. Mass.551.735
SMILESCCCC[C@@H]1C[C@@](CCN(C)CCCc2nc3ccccc3[nH]2)(OC(=O)COC)[C@@H](C(C)C)c2ccc(F)cc12