Reaction Details
TargetFKBP12A/mTOR
LigandBDBM92862
Substrate/Competitorn/a
Meas. Tech.ChEMBL_1514029 (CHEMBL3616334)
IC50 44±n/a nM
Citation Xie, XXLi, HWang, JMao, SXin, MHLu, SMMei, QBZhang, SQ Synthesis and anticancer effects evaluation of 1-alkyl-3-(6-(2-methoxy-3-sulfonylaminopyridin-5-yl)benzo[d]thiazol-2-yl)urea as anticancer agents with low toxicity. Bioorg Med Chem23:6477-85 (2015) 
 
FKBP12A/mTOR
Name:FKBP12A/mTOR
Type:n/a
Mol. Mass.:n/a
Description:ASSAY_ID of ChEMBL is 2232618
Components:This complex has 2 components.
Component 1
Name:Peptidyl-prolyl cis-trans isomerase FKBP1A
Synonyms:12 kDa FK506-binding protein FK506-binding protein 1A FKB1A_HUMAN FKBP-1A FKBP12 Immunophilin FKBP12 PPIase FKBP1A Rotamase mTOR/FKBP12A/FKBP12B
Type:Isomerase
Mol. Mass.:11953.09
Organism:Homo sapiens (Human)
Description:P62942
Residue:108
Component 2
Name:Serine/threonine-protein kinase mTOR
Synonyms:FK506-binding protein 12-rapamycin complex-associated protein 1 FRAP FRAP1 MTOR Mammalian Target of Rapamycin (mTOR) RAFT1 Rapamycin and FKBP12 target 1 Serine/threonine-protein kinase (mTOR) | mTORC2
Type:Rapamycin target protein
Mol. Mass.:288917.12
Organism:Homo sapiens (Human)
Description:P42345
Residue:2549
BDBM92862
NameBDBM92862
Synonyms:US9284315, BEZ-235 | mTOR Inhibitor, BEZ235
TypeSmall molecule
Emp. Form.C30H23N5O
Mol. Mass.469.5365
SMILESCn1c2cnc3ccc(cc3c2n(-c2ccc(cc2)C(C)(C)C#N)c1=O)-c1cnc2ccccc2c1