Reaction Details
TargetMu-type opioid receptor
LigandBDBM50118179
Substrate/Competitorn/a
Meas. Tech.ChEMBL_1514756 (CHEMBL3614957)
Ki 4.4±n/a nM
Citation Nakajima, RYamamoto, NHirayama, SIwai, TSaitoh, ANagumo, YFujii, HNagase, H Synthesis of new opioid derivatives with a propellane skeleton and their pharmacologies: Part 5, novel pentacyclic propellane derivatives with a 6-amide side chain. Bioorg Med Chem23:6271-9 (2015) 
 
Mu-type opioid receptor
Name:Mu-type opioid receptor
Type:Enzyme Catalytic Domain
Mol. Mass.:11165.58
Organism:GUINEA PIG
Description:P97266
Residue:98
BDBM50118179
NameBDBM50118179
Synonyms:CHEMBL3613168
TypeSmall organic molecule
Emp. Form.C42H54N2O6S
Mol. Mass.714.953
SMILESCC1(C)C2CCC1(CS(O)(=O)=O)C(=O)C2.[H][C@]12C[C@@]34Cc5ccc(O)cc5[C@@]3(CCN(CC3CC3)[C@@]4([H])C=C1)C[C@@H]2N(C)C(=O)CCc1ccccc1