Reaction Details
TargetKappa-type opioid receptor
LigandBDBM50118187
Substrate/Competitorn/a
Meas. Tech.ChEMBL_1514758 (CHEMBL3614959)
Ki 11±n/a nM
Citation Nakajima, RYamamoto, NHirayama, SIwai, TSaitoh, ANagumo, YFujii, HNagase, H Synthesis of new opioid derivatives with a propellane skeleton and their pharmacologies: Part 5, novel pentacyclic propellane derivatives with a 6-amide side chain. Bioorg Med Chem23:6271-9 (2015) 
 
Kappa-type opioid receptor
Name:Kappa-type opioid receptor
Type:Enzyme
Mol. Mass.:42656.78
Organism:Mus musculus (Mouse)
Description:P33534
Residue:380
BDBM50118187
NameBDBM50118187
Synonyms:CHEMBL3613281
TypeSmall organic molecule
Emp. Form.C31H39ClN2O2
Mol. Mass.507.107
SMILESCl.[H][C@]12CC[C@]3([H])N(CC4CC4)CC[C@@]4(C[C@@H]1N(C)C(=O)Cc1ccccc1)c1cc(O)ccc1C[C@@]34C2