Reaction Details
TargetStromelysin-1
LigandBDBM50119276
Substrate/Competitorn/a
Meas. Tech.ChEMBL_1518238 (CHEMBL3619996)
IC50 71±n/a nM
Citation Nuti, ECantelmo, ARGallo, CBruno, ABassani, BCamodeca, CTuccinardi, TVera, LOrlandini, ENencetti, SStura, EAMartinelli, ADive, VAlbini, ARossello, A N-O-Isopropyl Sulfonamido-Based Hydroxamates as Matrix Metalloproteinase Inhibitors: Hit Selection and in Vivo Antiangiogenic Activity. J Med Chem58:7224-40 (2015) 
 
Stromelysin-1
Name:Stromelysin-1
Type:Enzyme
Mol. Mass.:53973.13
Organism:Homo sapiens (Human)
Description: P08254
Residue:477
BDBM50119276
NameBDBM50119276
Synonyms:CHEMBL3617401
TypeSmall organic molecule
Emp. Form.C20H27N3O7S2
Mol. Mass.485.574
SMILESCC(C)ON([C@H](CCNS(C)(=O)=O)C(=O)NO)S(=O)(=O)c1ccc(cc1)-c1ccccc1