Reaction Details
Target72 kDa type IV collagenase
LigandBDBM50119281
Substrate/Competitorn/a
Meas. Tech.ChEMBL_1518237 (CHEMBL3619995)
IC50 0.370000±n/a nM
Citation Nuti, ECantelmo, ARGallo, CBruno, ABassani, BCamodeca, CTuccinardi, TVera, LOrlandini, ENencetti, SStura, EAMartinelli, ADive, VAlbini, ARossello, A N-O-Isopropyl Sulfonamido-Based Hydroxamates as Matrix Metalloproteinase Inhibitors: Hit Selection and in Vivo Antiangiogenic Activity. J Med Chem58:7224-40 (2015) 
 
72 kDa type IV collagenase
Name:72 kDa type IV collagenase
Type:Enzyme
Mol. Mass.:73870.36
Organism:Homo sapiens (Human)
Description: P08253
Residue:660
BDBM50119281
NameBDBM50119281
Synonyms:CHEMBL3617405
TypeSmall organic molecule
Emp. Form.C28H33N3O7S
Mol. Mass.555.643
SMILESCOc1ccc(cc1)-c1ccc(cc1)S(=O)(=O)N(OC(C)C)[C@H](CCNC(=O)Cc1ccccc1)C(=O)NO