Reaction Details
Target72 kDa type IV collagenase
LigandBDBM50119284
Substrate/Competitorn/a
Meas. Tech.ChEMBL_1518237 (CHEMBL3619995)
IC50 1.4±n/a nM
Citation Nuti, ECantelmo, ARGallo, CBruno, ABassani, BCamodeca, CTuccinardi, TVera, LOrlandini, ENencetti, SStura, EAMartinelli, ADive, VAlbini, ARossello, A N-O-Isopropyl Sulfonamido-Based Hydroxamates as Matrix Metalloproteinase Inhibitors: Hit Selection and in Vivo Antiangiogenic Activity. J Med Chem58:7224-40 (2015) 
 
72 kDa type IV collagenase
Name:72 kDa type IV collagenase
Type:Enzyme
Mol. Mass.:73870.36
Organism:Homo sapiens (Human)
Description: P08253
Residue:660
BDBM50119284
NameBDBM50119284
Synonyms:CHEMBL3617403
TypeSmall organic molecule
Emp. Form.C27H31N3O6S
Mol. Mass.525.617
SMILESCC(C)ON([C@H](CCNC(=O)Cc1ccccc1)C(=O)NO)S(=O)(=O)c1ccc(cc1)-c1ccccc1