Reaction Details
TargetStromelysin-1
LigandBDBM50119282
Substrate/Competitorn/a
Meas. Tech.ChEMBL_1518238 (CHEMBL3619996)
IC50 20±n/a nM
Citation Nuti, ECantelmo, ARGallo, CBruno, ABassani, BCamodeca, CTuccinardi, TVera, LOrlandini, ENencetti, SStura, EAMartinelli, ADive, VAlbini, ARossello, A N-O-Isopropyl Sulfonamido-Based Hydroxamates as Matrix Metalloproteinase Inhibitors: Hit Selection and in Vivo Antiangiogenic Activity. J Med Chem58:7224-40 (2015) 
 
Stromelysin-1
Name:Stromelysin-1
Type:Enzyme
Mol. Mass.:53973.13
Organism:Homo sapiens (Human)
Description: P08254
Residue:477
BDBM50119282
NameBDBM50119282
Synonyms:CHEMBL3617404
TypeSmall organic molecule
Emp. Form.C22H29N3O7S
Mol. Mass.479.547
SMILESCOc1ccc(cc1)-c1ccc(cc1)S(=O)(=O)N(OC(C)C)[C@H](CCNC(C)=O)C(=O)NO