Reaction Details
TargetMatrix metalloproteinase-9
LigandBDBM50119284
Substrate/Competitorn/a
Meas. Tech.ChEMBL_1518239 (CHEMBL3620106)
IC50 6.4±n/a nM
Citation Nuti, ECantelmo, ARGallo, CBruno, ABassani, BCamodeca, CTuccinardi, TVera, LOrlandini, ENencetti, SStura, EAMartinelli, ADive, VAlbini, ARossello, A N-O-Isopropyl Sulfonamido-Based Hydroxamates as Matrix Metalloproteinase Inhibitors: Hit Selection and in Vivo Antiangiogenic Activity. J Med Chem58:7224-40 (2015) 
 
Matrix metalloproteinase-9
Name:Matrix metalloproteinase-9
Type:Enzyme
Mol. Mass.:78452.28
Organism:Homo sapiens (Human)
Description:P14780
Residue:707
BDBM50119284
NameBDBM50119284
Synonyms:CHEMBL3617403
TypeSmall organic molecule
Emp. Form.C27H31N3O6S
Mol. Mass.525.617
SMILESCC(C)ON([C@H](CCNC(=O)Cc1ccccc1)C(=O)NO)S(=O)(=O)c1ccc(cc1)-c1ccccc1