Reaction Details
TargetMatrix metalloproteinase-9
LigandBDBM50119282
Substrate/Competitorn/a
Meas. Tech.ChEMBL_1518239 (CHEMBL3620106)
IC50 2.0±n/a nM
Citation Nuti, ECantelmo, ARGallo, CBruno, ABassani, BCamodeca, CTuccinardi, TVera, LOrlandini, ENencetti, SStura, EAMartinelli, ADive, VAlbini, ARossello, A N-O-Isopropyl Sulfonamido-Based Hydroxamates as Matrix Metalloproteinase Inhibitors: Hit Selection and in Vivo Antiangiogenic Activity. J Med Chem58:7224-40 (2015) 
 
Matrix metalloproteinase-9
Name:Matrix metalloproteinase-9
Type:Enzyme
Mol. Mass.:78452.28
Organism:Homo sapiens (Human)
Description:P14780
Residue:707
BDBM50119282
NameBDBM50119282
Synonyms:CHEMBL3617404
TypeSmall organic molecule
Emp. Form.C22H29N3O7S
Mol. Mass.479.547
SMILESCOc1ccc(cc1)-c1ccc(cc1)S(=O)(=O)N(OC(C)C)[C@H](CCNC(C)=O)C(=O)NO