Reaction Details
TargetMatrix metalloproteinase-14
LigandBDBM50119282
Substrate/Competitorn/a
Meas. Tech.ChEMBL_1518241 (CHEMBL3620108)
IC50 23±n/a nM
Citation Nuti, ECantelmo, ARGallo, CBruno, ABassani, BCamodeca, CTuccinardi, TVera, LOrlandini, ENencetti, SStura, EAMartinelli, ADive, VAlbini, ARossello, A N-O-Isopropyl Sulfonamido-Based Hydroxamates as Matrix Metalloproteinase Inhibitors: Hit Selection and in Vivo Antiangiogenic Activity. J Med Chem58:7224-40 (2015) 
 
Matrix metalloproteinase-14
Name:Matrix metalloproteinase-14
Type:Protein
Mol. Mass.:65900.19
Organism:Homo sapiens (Human)
Description:P50281
Residue:582
BDBM50119282
NameBDBM50119282
Synonyms:CHEMBL3617404
TypeSmall organic molecule
Emp. Form.C22H29N3O7S
Mol. Mass.479.547
SMILESCOc1ccc(cc1)-c1ccc(cc1)S(=O)(=O)N(OC(C)C)[C@H](CCNC(C)=O)C(=O)NO