Reaction Details
TargetProteasome subunit beta type-5
LigandBDBM50119302
Substrate/Competitorn/a
Meas. Tech.ChEMBL_1515347 (CHEMBL3615140)
Ki 1237±n/a nM
Citation Totaro, KABarthelme, DSimpson, PTSauer, RTSello, JK Substrate-guided optimization of the syringolins yields potent proteasome inhibitors with activity against leukemia cell lines. Bioorg Med Chem23:6218-22 (2015) 
 
Proteasome subunit beta type-5
Name:Proteasome subunit beta type-5
Type:Protein
Mol. Mass.:28480.96
Organism:Homo sapiens (Human)
Description:n/a
Residue:263
BDBM50119302
NameBDBM50119302
Synonyms:CHEMBL3613821
TypeSmall organic molecule
Emp. Form.C29H42ClN5O6
Mol. Mass.592.127
SMILESCOC(=O)[C@@H](NC(=O)N[C@@H](C(C)C)C(=O)N[C@H]1CCCCNC(=O)\C=C\[C@H](Cc2ccc(Cl)cc2)NC1=O)C(C)C