Reaction Details
TargetD(2) dopamine receptor
LigandBDBM50119392
Substrate/Competitorn/a
Meas. Tech.ChEMBL_1515737 (CHEMBL3614290)
Ki 85±n/a nM
Citation Möller, DSalama, IKling, RCHübner, HGmeiner, P 1,4-Disubstituted aromatic piperazines with high 5-HT2A/D2 selectivity: Quantitative structure-selectivity investigations, docking, synthesis and biological evaluation. Bioorg Med Chem23:6195-209 (2015) 
 
D(2) dopamine receptor
Name:D(2) dopamine receptor
Type:Cell-surface receptors
Mol. Mass.:50647.10
Organism:Homo sapiens (Human)
Description:P14416
Residue:443
BDBM50119392
NameBDBM50119392
Synonyms:CHEMBL141845 Pyrazolo[1,5-a]pyridine-3-carboxylic acid {2-[4-(2-methoxy-phenyl)-piperazin-1-yl]-ethyl}-amide
TypeSmall organic molecule
Emp. Form.C21H25N5O2
Mol. Mass.379.4555
SMILESCOc1ccccc1N1CCN(CCNC(=O)c2cnn3ccccc23)CC1