Reaction Details
TargetGlucagon receptor
LigandBDBM50120362
Substrate/Competitorn/a
Meas. Tech.ChEMBL_1518285 (CHEMBL3620260)
IC50 18±n/a nM
Citation Lin, SZhang, FJiang, GQureshi, SAYang, XChicchi, GGTota, LBansal, ABrady, ETrujillo, MSalituro, GMiller, CTata, JRZhang, BBParmee, ER A novel series of indazole-/indole-based glucagon receptor antagonists. Bioorg Med Chem Lett25:4143-7 (2015) 
 
Glucagon receptor
Name:Glucagon receptor
Type:Enzyme
Mol. Mass.:54026.92
Organism:Homo sapiens (Human)
Description:P47871
Residue:477
BDBM50120362
NameBDBM50120362
Synonyms:CHEMBL3616690
TypeSmall organic molecule
Emp. Form.C36H34F3N3O4
Mol. Mass.629.6681
SMILESCCCCC(c1ccc(cc1)C(=O)NCCC(O)=O)n1nc(-c2cc(ccc2OC)C(F)(F)F)c2ccc(cc12)-c1ccccc1